{"text_format":"1","workbook":"xlsx","n_sheets":7,"sheets":["Briefvorlage","Rechnungsvorlage","Kunden","Dienstleistungen","DL_Paket_Vorlagen","Einstellungen","Shulung"],"not_rendered":{"charts":0,"images":23,"macros":1,"external_links":0,"defined_names":28,"comments":2,"pivot_tables":0},"unopened":[],"bounds":{"document_bytes":16777216,"sheet_cells":100000,"rows_first":2000,"rows_last":500,"rows_between":2000,"halvings":0,"cell_chars":16384,"cell_head_chars":4096},"cells_cut":0,"cells_raw":0,"read":"whole","date_system":"1900"}

{"sheet":"Briefvorlage","index":0,"n_rows":50,"n_cols":10,"rows_kept":50,"cut":false,"hidden":false,"merged":[[0,1,0,4],[0,5,0,7],[1,1,1,4],[1,5,4,7],[5,5,6,7],[2,1,2,4],[3,1,4,4],[5,1,6,4],[12,1,12,6],[7,1,7,3],[8,5,8,7],[9,1,9,7],[11,1,11,7],[10,1,10,7]]}
[null,"Empfänger:",null,null,null,"Zusätzliche-Kundenstammdaten",null,null,null,"Dummy für Zeilenhöhe"]
[null,"BOCS Unternehmensberatung Ingenierbüro e.U. ",null,null,null,{"$f":"VLOOKUP(B2,Kunden!$A$2:$E$31,5,FALSE)","v":"Firmenbuch. FN 309397 x \nUID AT U64249799\nemail:  office@bocs.at\n www.bocs.at"}]
[null,{"$f":"VLOOKUP(B2,Kunden!$A$2:$E$31,2,FALSE) &\" \"& VLOOKUP(B2,Kunden!$A$2:$E$31,3,FALSE)","v":"Herr Ing.Dipl.Wi.Ing.(FH) Alexander Salib"},null,null,null,null,null,null,null,".\n.\n"]
[null,{"$f":"VLOOKUP(B2,Kunden!$A$2:$E$31,4,FALSE)","v":"Reindorfgasse 32 \nA-1150 Wien "},null,null,null,null,null,null,null,".\n."]
[]
[null,null,null,null,null,null,null,null,null,".\n."]
[null,null,null,null,null,null,null,null,null,"."]
[null,"Betrifft:",null,null,"BÜROREINIGUNG /  Unterhaltsreinigung   \"Regelmässig\"",null,"Datum: ",{"$f":"TODAY()+Rechnungsvorlage!D50","v":"2022-11-04"}]
[]
[null,{"$f":"VLOOKUP($B$2,Kunden!A2:F31,6,FALSE)&\" \"&B3&\",\"","v":"Sehr geehrter Herr Ing.Dipl.Wi.Ing.(FH) Alexander Salib,"},null,null,null,null,null,null,null,".\n."]
[null,"danke für das entgegengebrachte Vertrauen in unser Unternehmen.",null,null,null,null,null,null,null,{"$f":"B11","v":"danke für das entgegengebrachte Vertrauen in unser Unternehmen."}]
[null,"Gerne beantworte ich Ihre Fragen:\n1) \n2)\n3) ",null,null,null,null,null,null,null,{"$f":"B12","v":"Gerne beantworte ich Ihre Fragen:\n1) \n2)\n3) "}]
[null,"Sind Sie zufrieden mit unserer Leistung? Dann empfehlen Sie uns doch weiter. \nSollten sie Verbesserungsvorschläge für uns haben, so sagen sie es uns einfach.\n\nVielen Dank\n",null,null,null,null,null,null,null,{"$f":"B13","v":"Sind Sie zufrieden mit unserer Leistung? Dann empfehlen Sie uns doch weiter. \nSollten sie Verbesserungsvorschläge für uns haben, so sagen sie es uns einfach.\n\nVielen Dank\n"}]
[null,null,null,null,null,{"$f":"F50","v":1}]
[]
[]
[]
[]
[]
[]
{"$rows_left_out":31}
{"sheet":"Rechnungsvorlage","index":1,"n_rows":50,"n_cols":28,"rows_kept":50,"cut":false,"hidden":false,"merged":[[0,1,0,4],[0,5,0,7],[46,5,46,6],[44,5,44,6],[45,5,45,6],[40,5,40,6],[41,5,41,6],[42,5,42,6],[9,1,9,7],[5,1,5,3],[6,1,6,3],[1,5,4,7],[10,1,10,7],[40,2,40,3],[44,2,44,3],[7,1,7,3],[1,1,1,4],[5,5,6,7],[48,1,48,6],[35,2,35,5],[37,1,37,4],[11,1,11,4],[33,2,34,5],[8,5,8,7],[43,3,43,4],[2,1,2,4],[3,1,4,4]]}
[null,"Rechnungsempfänger:",null,null,null,"Zusätzliche-Kundenstammdaten",null,null,null,"Dummy für Zeilenhöhe"]
[null,"BOCS Unternehmensberatung Ingenierbüro e.U. ",null,null,null,{"$f":"VLOOKUP(B2,Kunden!$A$2:$E$31,5,FALSE)","v":"Firmenbuch. FN 309397 x \nUID AT U64249799\nemail:  office@bocs.at\n www.bocs.at"},null,null,null,null,null,null,null,null,null,null,null,null,null,null,null,null,null,null,null,"Geschäftsprozesse","Kopftexte","Fusstexte"]
[null,{"$f":"VLOOKUP(B2,Kunden!$A$2:$E$31,2,FALSE) &\" \"& VLOOKUP(B2,Kunden!$A$2:$E$31,3,FALSE)","v":"Herr Ing.Dipl.Wi.Ing.(FH) Alexander Salib"},null,null,null,null,null,null,null,null,null,null,null,null,null,null,null,null,null,null,null,null,null,null,null,{"$f":"Einstellungen!G2","v":"Rechnung Nr.:"},{"$f":"Einstellungen!H2","v":"wir bedanken uns für das entgegen gebrachte Vertrauen und erlauben unsere Leistungen wie folgt zu verrechnen:"},{"$f":"Einstellungen!I2","v":"Bitte bezahlen sie folgenden fälligen Betrag:  "}]
[null,{"$f":"VLOOKUP(B2,Kunden!$A$2:$E$31,4,FALSE)","v":"Reindorfgasse 32 \nA-1150 Wien "},null,null,null,null,null,null,null,".\n.",null,null,null,null,null,null,null,null,null,null,null,null,null,null,null,{"$f":"Einstellungen!G3","v":"Zahlungserinnerung\nzur Rechnung Nr.:"},{"$f":"Einstellungen!H3","v":"Leider konnten wir bis zum heutigen Datum keinerlei Einzahlungen ihrerseits auf unserem Konto feststellen.\nSollten Sie zwischenzeitlich schon bezahlt haben so sehen sie dieses Schreiben als erledigt an."},{"$f":"Einstellungen!I3","v":"Bitte bezahlen sie folgenden überfälligen Betrag prompt:  "}]
[null,null,null,null,null,null,null,null,null,null,null,null,null,null,null,null,null,null,null,null,null,null,null,null,null,{"$f":"Einstellungen!G4","v":"Angebot Nr.: "},{"$f":"Einstellungen!H4","v":"wir freuen uns sehr, wenn Sie sich für unser Angebot entscheiden und bieten Ihnen wie folgt an:"},{"$f":"Einstellungen!I4","v":44899}]
[null,"Rechnung Nr.:",null,null,"4711-2022",null,null,null,null,".\n.",null,null,null,null,null,null,null,null,null,null,null,null,null,null,null,{"$f":"Einstellungen!G5","v":"Auftragsbestätigung"},{"$f":"Einstellungen!H5","v":"gerne bestätigen wir Ihnen den Auftrag wie folgt:"},{"$f":"Einstellungen!I5","v":"Der Wert dieser Lieferung beträgt Gesamt:   "}]
[null,"Betrifft:",null,null,"BÜROREINIGUNG /  Unterhaltsreinigung   \"Regelmäßig\"",null,null,null,null,{"$f":"E7","v":"BÜROREINIGUNG /  Unterhaltsreinigung   \"Regelmäßig\""},null,null,null,null,null,null,null,null,null,null,null,null,null,null,null,{"$f":"Einstellungen!G6","v":"Lieferschein Nr.:"},{"$f":"Einstellungen!H6","v":"Ihre Lieferung enthält folgende Positionen:"},{"$f":"Einstellungen!I6","v":"Folgenden Betrag erhalten sie Retour:   "}]
[null,"Zahlungsbedingung:",null,null,"Zahlungsziel 14 Tage",null,"Datum: ",{"$f":"TODAY()+D50","v":"2022-11-04"},null,null,null,null,null,null,null,null,null,null,null,null,null,null,null,null,null,{"$f":"Einstellungen!G7","v":"Gutschrift Nr.:"},{"$f":"Einstellungen!H7","v":"Ihre Gutschrift enthlält folgende Positionen:"},{"$f":"Einstellungen!I7","v":"  "}]
[null,null,null,null,null,null,null,null,null,null,null,null,null,null,null,null,null,null,null,null,null,null,null,null,null,{"$f":"Einstellungen!G8","v":0},{"$f":"Einstellungen!H8","v":0},{"$f":"Einstellungen!I8","v":0}]
[null,{"$f":"VLOOKUP($B$2,Kunden!A2:F31,6,FALSE)&\" \"&B3&\",\"","v":"Sehr geehrter Herr Ing.Dipl.Wi.Ing.(FH) Alexander Salib,"},null,null,null,null,null,null,null,{"$f":"B10","v":"Sehr geehrter Herr Ing.Dipl.Wi.Ing.(FH) Alexander Salib,"},null,null,null,null,null,null,null,null,null,null,null,null,null,null,null,{"$f":"Einstellungen!G9","v":0},{"$f":"Einstellungen!H9","v":0},{"$f":"Einstellungen!I9","v":0}]
[null,{"$f":"VLOOKUP(B6,Z2:AB10,2,FALSE)","v":"wir bedanken uns für das entgegen gebrachte Vertrauen und erlauben unsere Leistungen wie folgt zu verrechnen:"},null,null,null,null,null,null,null,{"$f":"B11","v":"wir bedanken uns für das entgegen gebrachte Vertrauen und erlauben unsere Leistungen wie folgt zu verrechnen:"}]
[null,null,null,null,null,null,"Leistungserbringung:",{"$f":"TODAY()+D50","v":"2022-11-04"}]
[null,"Pos","Menge","Einheit","Tätigkeit/ Produkt/  Leistungsbeschreibung","Preis \n€ / Einheit","Rabatt\n% / Position","Gesamt\n € / Position"]
[null,10,12,{"$f":"IFERROR(VLOOKUP($E14,Dienstleistungen!$A$2:$D$27,3,FALSE),\"\")","v":"Stunden"},"Büroreinigung/ Unterhaltsreinigung. \nNasswischen glatter Oberflächen, Staubsaugen, Staubwischen, Fussboden wischen, Müllertsorgen, Pflanzen gießen. Reinigung von Küche Sanitäranlagen,. \n",{"$f":"IFERROR(VLOOKUP($E14,Dienstleistungen!$A$2:$D$27,4,FALSE),\"\")","v":25},null,{"$f":"IFERROR(IF(C14*F14*(1-G14)<>0,C14*F14*(1-G14),\"\"),\"\")","v":300}]
[null,20,4,{"$f":"IFERROR(VLOOKUP($E15,Dienstleistungen!$A$2:$D$27,3,FALSE),\"\")","v":"Anfahrt"},"PKW-Aufwand innerhalb Wien inkl. Parkgebühren",{"$f":"IFERROR(VLOOKUP($E15,Dienstleistungen!$A$2:$D$27,4,FALSE),\"\")","v":80},1,{"$f":"IFERROR(IF(C15*F15*(1-G15)<>0,C15*F15*(1-G15),\"\"),\"\")","v":""}]
[null,30,null,{"$f":"IFERROR(VLOOKUP($E16,Dienstleistungen!$A$2:$D$27,3,FALSE),\"\")","v":""},null,null,null,{"$f":"IFERROR(IF(C16*F16*(1-G16)<>0,C16*F16*(1-G16),\"\"),\"\")","v":""}]
[null,40,null,{"$f":"IFERROR(VLOOKUP($E17,Dienstleistungen!$A$2:$D$27,3,FALSE),\"\")","v":""},null,{"$f":"IFERROR(VLOOKUP($E17,Dienstleistungen!$A$2:$D$27,4,FALSE),\"\")","v":""},null,{"$f":"IFERROR(IF(C17*F17*(1-G17)<>0,C17*F17*(1-G17),\"\"),\"\")","v":""}]
[null,50,{"$f":"IFERROR(VLOOKUP($E18,Dienstleistungen!$A$2:$D$27,2,FALSE),\"\")","v":""},{"$f":"IFERROR(VLOOKUP($E18,Dienstleistungen!$A$2:$D$27,3,FALSE),\"\")","v":""},null,{"$f":"IFERROR(VLOOKUP($E18,Dienstleistungen!$A$2:$D$27,4,FALSE),\"\")","v":""},null,{"$f":"IFERROR(IF(C18*F18*(1-G18)<>0,C18*F18*(1-G18),\"\"),\"\")","v":""}]
[null,60,{"$f":"IFERROR(VLOOKUP($E19,Dienstleistungen!$A$2:$D$27,2,FALSE),\"\")","v":""},{"$f":"IFERROR(VLOOKUP($E19,Dienstleistungen!$A$2:$D$27,3,FALSE),\"\")","v":""},null,{"$f":"IFERROR(VLOOKUP($E19,Dienstleistungen!$A$2:$D$27,4,FALSE),\"\")","v":""},null,{"$f":"IFERROR(IF(C19*F19*(1-G19)<>0,C19*F19*(1-G19),\"\"),\"\")","v":""}]
[null,70,{"$f":"IFERROR(VLOOKUP($E20,Dienstleistungen!$A$2:$D$27,2,FALSE),\"\")","v":""},{"$f":"IFERROR(VLOOKUP($E20,Dienstleistungen!$A$2:$D$27,3,FALSE),\"\")","v":""},null,{"$f":"IFERROR(VLOOKUP($E20,Dienstleistungen!$A$2:$D$27,4,FALSE),\"\")","v":""},null,""]
{"$rows_left_out":31}
{"sheet":"Kunden","index":2,"n_rows":31,"n_cols":7,"rows_kept":31,"cut":false,"hidden":false,"merged":[]}
["Firmenname","Anrede","Name / Adresszeile","Adresse","Zusätzliche Kundenstammdaten","Anredekombination","  "]
["Aufsperrprofi e.U.","Herr","Markus Wagner","Vorgartenmarkt 5 \n1020 Wien","FN: 362433s\nUID: ATU57243389\nTelefon: 0664/916 06 33\nE-Mail: office@aufsperrprofi.at",{"$f":"IFERROR(VLOOKUP(Tabelle3[[#This Row],[Anrede]],Anredetext,2,FALSE),\"Sehr geehrte Damen und Herren\")","v":"Sehr geehrter"}]
["BOCS Unternehmensberatung Ingenierbüro e.U. ","Herr","Ing.Dipl.Wi.Ing.(FH) Alexander Salib","Reindorfgasse 32 \nA-1150 Wien ","Firmenbuch. FN 309397 x \nUID AT U64249799\nemail:  office@bocs.at\n www.bocs.at",{"$f":"IFERROR(VLOOKUP(Tabelle3[[#This Row],[Anrede]],Anredetext,2,FALSE),\"Sehr geehrte Damen und Herren\")","v":"Sehr geehrter"}]
["Einmalkunde",null,null,"Keine","Keine",{"$f":"IFERROR(VLOOKUP(Tabelle3[[#This Row],[Anrede]],Anredetext,2,FALSE),\"Sehr geehrte Damen und Herren\")","v":"Sehr geehrte Damen und Herren"},"KUNDEN - s o r t i e r e n"]
["Familie,","Herr","Georg ,","Bossigasse ,,\n1130 Wien","Tel: 01/ 00000",{"$f":"IFERROR(VLOOKUP(Tabelle3[[#This Row],[Anrede]],Anredetext,2,FALSE),\"Sehr geehrte Damen und Herren\")","v":"Sehr geehrter"}]
["Immobilienverwaltung Barilich GmbH","Herr","Christian Liebetreu","Fillgradergasse 7/ 4. Stock\nA-1060 Wien\n","Ansprechpartner: Felix Kriegler\n+43 1 961 81 66\nwww.iv-b.at  office@iv-b.at\nUID: ATU73401669\nFirmenbuchnummer: FN 492811 y",{"$f":"IFERROR(VLOOKUP(Tabelle3[[#This Row],[Anrede]],Anredetext,2,FALSE),\"Sehr geehrte Damen und Herren\")","v":"Sehr geehrter"}]
["NowBor e.U.","Frau","Ewa Nowak","Meinhartsdorfergasse 9/ 15\nA-1150 Wien","Firmenbuch Nr.: FN 535900p \nHandelsgericht Wien\nUID: ATU 75749512\nnowbor@bocs.at  www.nowbor.bocs.at\n+43/ 699/ 172 614 95",{"$f":"IFERROR(VLOOKUP(Tabelle3[[#This Row],[Anrede]],Anredetext,2,FALSE),\"Sehr geehrte Damen und Herren\")","v":"Sehr geehrte"}]
["Relax BOCS loung bar & cafe","Frau","Ewa Nowak","Reindorfgasse 32\nA-1150 Wien","Firmenbuch Nr.: FN 535900p \nHandelsgericht Wien\nUID: ATU 75749512\nRelax@bocs.at  www.Relax.BOCS.at\n+43/ 699/ 172 614 95",{"$f":"IFERROR(VLOOKUP(Tabelle3[[#This Row],[Anrede]],Anredetext,2,FALSE),\"Sehr geehrte Damen und Herren\")","v":"Sehr geehrte"}]
["Sorglos und Sicher Treuer GmbH.","Herr","Markus Treuer","Blindengasse 7-9\nMezzanin, Top 16\n1080 Wien","Firmenbuch. 519564s\nUID: AT U64249799\nT +43 699 112 31 981\nM +43 676 902 79 40\ndijana.treuer@sorglosundsicher.at",{"$f":"IFERROR(VLOOKUP(Tabelle3[[#This Row],[Anrede]],Anredetext,2,FALSE),\"Sehr geehrte Damen und Herren\")","v":"Sehr geehrter"}]
[null,null,null,null,null,{"$f":"IFERROR(VLOOKUP(Tabelle3[[#This Row],[Anrede]],Anredetext,2,FALSE),\"Sehr geehrte Damen und Herren\")","v":"Sehr geehrte Damen und Herren"}]
[null,null,null,null,null,{"$f":"IFERROR(VLOOKUP(Tabelle3[[#This Row],[Anrede]],Anredetext,2,FALSE),\"Sehr geehrte Damen und Herren\")","v":"Sehr geehrte Damen und Herren"}]
[null,null,null,null,null,{"$f":"IFERROR(VLOOKUP(Tabelle3[[#This Row],[Anrede]],Anredetext,2,FALSE),\"Sehr geehrte Damen und Herren\")","v":"Sehr geehrte Damen und Herren"}]
[null,null,null,null,null,{"$f":"IFERROR(VLOOKUP(Tabelle3[[#This Row],[Anrede]],Anredetext,2,FALSE),\"Sehr geehrte Damen und Herren\")","v":"Sehr geehrte Damen und Herren"}]
[null,null,null,null,null,{"$f":"IFERROR(VLOOKUP(Tabelle3[[#This Row],[Anrede]],Anredetext,2,FALSE),\"Sehr geehrte Damen und Herren\")","v":"Sehr geehrte Damen und Herren"}]
[null,null,null,null,null,{"$f":"IFERROR(VLOOKUP(Tabelle3[[#This Row],[Anrede]],Anredetext,2,FALSE),\"Sehr geehrte Damen und Herren\")","v":"Sehr geehrte Damen und Herren"}]
[null,null,null,null,null,{"$f":"IFERROR(VLOOKUP(Tabelle3[[#This Row],[Anrede]],Anredetext,2,FALSE),\"Sehr geehrte Damen und Herren\")","v":"Sehr geehrte Damen und Herren"}]
[null,null,null,null,null,{"$f":"IFERROR(VLOOKUP(Tabelle3[[#This Row],[Anrede]],Anredetext,2,FALSE),\"Sehr geehrte Damen und Herren\")","v":"Sehr geehrte Damen und Herren"}]
[null,null,null,null,null,{"$f":"IFERROR(VLOOKUP(Tabelle3[[#This Row],[Anrede]],Anredetext,2,FALSE),\"Sehr geehrte Damen und Herren\")","v":"Sehr geehrte Damen und Herren"}]
[null,null,null,null,null,{"$f":"IFERROR(VLOOKUP(Tabelle3[[#This Row],[Anrede]],Anredetext,2,FALSE),\"Sehr geehrte Damen und Herren\")","v":"Sehr geehrte Damen und Herren"}]
[null,null,null,null,null,{"$f":"IFERROR(VLOOKUP(Tabelle3[[#This Row],[Anrede]],Anredetext,2,FALSE),\"Sehr geehrte Damen und Herren\")","v":"Sehr geehrte Damen und Herren"}]
{"$rows_left_out":12}
{"sheet":"Dienstleistungen","index":3,"n_rows":18,"n_cols":5,"rows_kept":18,"cut":false,"hidden":false,"merged":[]}
["Tätigkeit/ Produkt/  Leistungsbeschreibung","Menge","Einheit","Preis \n€ / Einheit"]
["PKW-Aufwand innerhalb Wien inkl. Parkgebühren",1,"Anfahrt",80]
["PKW-Aufwand Niederösterreich inkl. Parkgebühren",1,"Anfahrt",100]
["LKW-Regiekosten",1,"Stunden",41]
["Fuhre zur Deponie inkl. Entsorgungskosten",1,"Anfahrt",250]
["Regiestunden für zusätzliche Arbeit",1,"Stunden",41]
["Zusatzkosten",1,"Pausch.",100]
[]
["Gartengestaltung & Gartenarbeiten\nAnlegen und Pflegen von Beeten, das Säen, Pflanzen und Pflegen von Blumen, Sträuchern, Hecken und Bäumen. Rasen säen und mähen, umgraben, Unkraut jäten, usw.",1,"Stunden",41]
["Zusatzkosten\nzB. Saatgut, Pflanzen, Dünger, Unkrautvernichter, Mulch, Schädlingsbekämpfung usw.\nWerkzeuge-, Geräte-, Maschinen- und Energiekosten ",1,"Pausch.",100]
[null,null,null,null,"PREISLISTE\nProdukt und Dienstleistungen"]
["Büroreinigung/ Unterhaltsreinigung. \nNasswischen glatter Oberflächen, Staubsaugen, Staubwischen, Fussboden wischen, Müllertsorgen, Pflanzen gießen. Reinigung von Küche Sanitäranlagen,. \n",1,"Stunden",25]
["Grundreinigung/ Frühjahresputz \nBesonders gründliche Hygienereinigung und Sauberkeit. Einrichtungsgegenstände, Betriebsmittel oder Bodenbeläge werden von Grund auf gereinigt. ",1,"Stunden",25]
["Hausbetreuung & Hausreinigung\nKomplette Hausreinigung, inklusive Gehsteig und Grünflächenbetreuung. Gründliche Hygiene und Sauberkeit in Stiegen, Vorräumen, Wartebereichen usw.\n",1,"Stunden",25]
["Material- und Werkzeugpauschale\nKleinteile für Wartungsarbeiten (Glühbirnen usw.)\nWerkzeuganteil (Maschinenkosten)\nHilfsstoffe (Putzmittel usw.)\n",1,"Pausch.",100]
[]
["Winterservice - Schneeräumung & Streuung \nBehandlung von Gehsteigen, Einfahrten, Parkplätzen und Flächen mit geeignetem Streumittel. Tauwetterkontrolle und Maßnahmen gegen Glatteis, Eiszapfen, Dachlawinen, usw. bis zur Splittentfernung.\n",1,"Std",41]
["Maschinen-, Werkzeug- und Materialpauschale\nWerkzeugabnützung, Maschinen- Treibstoff und Energiekosten\nHilfsstoffe wie Streusplitt, Streusalz (Natriumchlorid oder Kaliumkarbonat), Entsorgung von Einkehrmaterial  usw.",1,"Pausch.",100]

{"sheet":"DL_Paket_Vorlagen","index":4,"n_rows":44,"n_cols":8,"rows_kept":44,"cut":false,"hidden":false,"merged":[[28,1,28,3],[37,1,37,3],[1,1,1,3],[10,1,10,3],[19,1,19,3]]}
[]
[null,"Postitions Vorlage 1",null,null,"G A R T E N G E S T A L T U N G   &   Gartenpflege"]
[null,"Pos","Menge","Einheit","Tätigkeit/ Produkt/  Leistungsbeschreibung","Preis \n€ / Einheit","Rabatt\n% / Position","Gesamt\n € / Position"]
[null,10,180,"Stunden","Gartengestaltung & Gartenarbeiten\nAnlegen und Pflegen von Beeten, das Säen, Pflanzen und Pflegen von Blumen, Sträuchern, Hecken und Bäumen. Rasen säen und mähen, umgraben, Unkraut jäten, usw.",41,null,{"$f":"IFERROR(IF(C4*F4*(1-G4)<>0,C4*F4*(1-G4),\"\"),\"\")","v":7380}]
[null,20,1,{"$f":"IFERROR(VLOOKUP($E5,Dienstleistungen!$A$2:$D$27,3,FALSE),\"\")","v":"Pausch."},"Zusatzkosten\nzB. Saatgut, Pflanzen, Dünger, Unkrautvernichter, Mulch, Schädlingsbekämpfung usw.\nWerkzeuge-, Geräte-, Maschinen- und Energiekosten ",200,null,{"$f":"IFERROR(IF(C5*F5*(1-G5)<>0,C5*F5*(1-G5),\"\"),\"\")","v":200}]
[null,30,23,{"$f":"IFERROR(VLOOKUP($E6,Dienstleistungen!$A$2:$D$27,3,FALSE),\"\")","v":"Stunden"},"LKW-Regiekosten",{"$f":"IFERROR(VLOOKUP($E6,Dienstleistungen!$A$2:$D$27,4,FALSE),\"\")","v":41},null,{"$f":"IFERROR(IF(C6*F6*(1-G6)<>0,C6*F6*(1-G6),\"\"),\"\")","v":943}]
[null,40,null,{"$f":"IFERROR(VLOOKUP($E7,Dienstleistungen!$A$2:$D$27,3,FALSE),\"\")","v":"Anfahrt"},"Fuhre zur Deponie inkl. Entsorgungskosten",{"$f":"IFERROR(VLOOKUP($E7,Dienstleistungen!$A$2:$D$27,4,FALSE),\"\")","v":250},null,{"$f":"IFERROR(IF(C7*F7*(1-G7)<>0,C7*F7*(1-G7),\"\"),\"\")","v":""}]
[null,50,{"$f":"IFERROR(VLOOKUP($E8,Dienstleistungen!$A$2:$D$27,2,FALSE),\"\")","v":""},{"$f":"IFERROR(VLOOKUP($E8,Dienstleistungen!$A$2:$D$27,3,FALSE),\"\")","v":""},null,{"$f":"IFERROR(VLOOKUP($E8,Dienstleistungen!$A$2:$D$27,4,FALSE),\"\")","v":""},null,{"$f":"IFERROR(IF(C8*F8*(1-G8)<>0,C8*F8*(1-G8),\"\"),\"\")","v":""}]
[]
[]
[null,"Postitions Vorlage 2",null,null,"BÜROREINIGUNG /  Unterhaltsreinigung   \"Regelmäßig\""]
[null,"Pos","Menge","Einheit","Tätigkeit/ Produkt/  Leistungsbeschreibung","Preis \n€ / Einheit","Rabatt\n% / Position","Gesamt\n € / Position"]
[null,10,12,{"$f":"IFERROR(VLOOKUP($E13,Dienstleistungen!$A$2:$D$27,3,FALSE),\"\")","v":"Stunden"},"Büroreinigung/ Unterhaltsreinigung. \nNasswischen glatter Oberflächen, Staubsaugen, Staubwischen, Fussboden wischen, Müllertsorgen, Pflanzen gießen. Reinigung von Küche Sanitäranlagen,. \n",{"$f":"IFERROR(VLOOKUP($E13,Dienstleistungen!$A$2:$D$27,4,FALSE),\"\")","v":25},null,{"$f":"IFERROR(IF(C13*F13*(1-G13)<>0,C13*F13*(1-G13),\"\"),\"\")","v":300}]
[null,20,4,{"$f":"IFERROR(VLOOKUP($E14,Dienstleistungen!$A$2:$D$27,3,FALSE),\"\")","v":"Anfahrt"},"PKW-Aufwand innerhalb Wien inkl. Parkgebühren",{"$f":"IFERROR(VLOOKUP($E14,Dienstleistungen!$A$2:$D$27,4,FALSE),\"\")","v":80},1,{"$f":"IFERROR(IF(C14*F14*(1-G14)<>0,C14*F14*(1-G14),\"\"),\"\")","v":""}]
[null,30,null,{"$f":"IFERROR(VLOOKUP($E15,Dienstleistungen!$A$2:$D$27,3,FALSE),\"\")","v":""},null,null,null,{"$f":"IFERROR(IF(C15*F15*(1-G15)<>0,C15*F15*(1-G15),\"\"),\"\")","v":""}]
[null,40,null,{"$f":"IFERROR(VLOOKUP($E16,Dienstleistungen!$A$2:$D$27,3,FALSE),\"\")","v":""},null,{"$f":"IFERROR(VLOOKUP($E16,Dienstleistungen!$A$2:$D$27,4,FALSE),\"\")","v":""},null,{"$f":"IFERROR(IF(C16*F16*(1-G16)<>0,C16*F16*(1-G16),\"\"),\"\")","v":""}]
[null,50,{"$f":"IFERROR(VLOOKUP($E17,Dienstleistungen!$A$2:$D$27,2,FALSE),\"\")","v":""},{"$f":"IFERROR(VLOOKUP($E17,Dienstleistungen!$A$2:$D$27,3,FALSE),\"\")","v":""},null,{"$f":"IFERROR(VLOOKUP($E17,Dienstleistungen!$A$2:$D$27,4,FALSE),\"\")","v":""},null,{"$f":"IFERROR(IF(C17*F17*(1-G17)<>0,C17*F17*(1-G17),\"\"),\"\")","v":""}]
[]
[]
[null,"Postitions Vorlage 3",null,null,"G R U N D R E I N I G U N G   Gründlicher \"Frühjahrsputz\""]
{"$rows_left_out":25}
{"sheet":"Einstellungen","index":5,"n_rows":29,"n_cols":23,"rows_kept":29,"cut":false,"hidden":true,"merged":[]}
["Mengeneinheiten","Fusstexte ","Betrifft:","Projektbezeichnungen","Gesamtrabatt Texte","Zahlungsbedingung:","Geschäftsprozesse","Kopftexte","Text links von Zahlsumme","Anrede","Textbeginn","Briefeinleitung","Hauptteil"]
["Pausch.","\nMit freundlichen Grüßen \n","Betrifft:","G A R T E N G E S T A L T U N G   &   Gartenpflege","Besonderer STAMMKUNDEN - RABATT","Sofort bei Auftragserteilung","Rechnung Nr.:","wir bedanken uns für das entgegen gebrachte Vertrauen und erlauben unsere Leistungen wie folgt zu verrechnen:","Bitte bezahlen sie folgenden fälligen Betrag:  ","Herr","Sehr geehrter","danke für das entgegengebrachte Vertrauen in unser Unternehmen.","Folgende Informationen konnte ich für Sie einholen:\n1) \n2)\n3) \n"]
["Stück","Wenn sich weitere Fragen ergeben oder ich irgendetwas für Sie tun kann, zögern Sie bitte nicht, mich anzurufen oder mir eine E-Mail zu schicken.\n\nMit freundlichen Grüßen \n\n","Betrifft Projekt:","BÜROREINIGUNG /  Unterhaltsreinigung   \"Regelmässig\"","Für Ihr umfangreiches Vorhaben gewähren wir folgenden PROJEKT-RABATT:","Sofort nach Rechnungserhalt","Zahlungserinnerung\nzur Rechnung Nr.:","Leider konnten wir bis zum heutigen Datum keinerlei Einzahlungen ihrerseits auf unserem Konto feststellen.\nSollten Sie zwischenzeitlich schon bezahlt haben so sehen sie dieses Schreiben als erledigt an.","Bitte bezahlen sie folgenden überfälligen Betrag prompt:  ","Frau","Sehr geehrte","vielen Dank für das nette Telefongespräch.","Gerne beantworte ich Ihre Fragen:\n1) \n2)\n3) "]
["Liter","Sind Sie zufrieden mit unserer Leistung? Dann empfehlen Sie uns doch weiter. \nSollten Sie Verbesserungsvorschläge für uns haben, so sagen sie es uns einfach.\n\nVielen Dank\n","Betrifft Auftrag:","G R U N D R E I N I G U N G   Gründlicher \"Frühjaresputz\"","Ihr Projekt wird als Success Story mit Fotos als Unsere Referenz weiterverwendet. Dafür gewähren wir Ihnen einen besonderen REFERENZ-RABATT:","Sofort bei Fertigstellung mit Bargeld","Angebot Nr.: ","wir freuen uns sehr, wenn Sie sich für unser Angebot entscheiden und bieten Ihnen wie folgt an:",{"$f":"TODAY()+30+Rechnungsvorlage!D50","v":"2022-12-04"},"Geschäftsleitung","Sehr geehrte","vielen Dank für Ihre Ihren wertvollen Hinweis!","Wir möchten uns nochmals für die Unannehmlichkeiten entschuldigen und sclagen folgendes vor:\n1) \n2)\n3) "]
["Meter","Ihr Vertrauen und die gute Zusammenarbeit ist uns wichtig. \n\nMit freundlichen Grüßen \n","Betrifft Ihre Anfrage:","HAUSBESORGERDIENST - STIEGENHAUS - Reinigung",null,"Zahlungsziel 14 Tage","Auftragsbestätigung","gerne bestätigen wir Ihnen den Auftrag wie folgt:","Der Wert dieser Lieferung beträgt Gesamt:   ",null,"Sehr geehrte Damen und Herren","danke Ihnen für Ihr Interesse an unseren Dienstleistungen.","Beiliegend erhalten Sie wie vereinbart die Rechnung für die lezte Abrechnungsperiode."]
["Anfahrt",null,"Betrifft Ihre Reklamation:","W I N T E R D I E N S T",null,"Zahlungsziel 30 Tage","Lieferschein Nr.:","Ihre Lieferung enthält folgende Positionen:","Folgenden Betrag erhalten sie Retour:   ",null,"Sehr geehrte Damen und Herren","bitte entschuldigen Sie, dass ich mich erst jetzt melde.\n"]
["Anfahrten",null,null,null,null,"Zahlungsziel 60 Tage","Gutschrift Nr.:","Ihre Gutschrift enthlält folgende Positionen:","  ",null,"Sehr geehrte Damen und Herren"]
[null,null,null,null,null,null,null,null,null,null,null,null,null,null,null,null,null,null,null,null,null,null,1]
["Stunden"]
["Vormittage"]
["Nachmittage"]
["Halbtage"]
["Tage"]
["Woche"]
["Wochen"]
["Monat"]
["Monate"]
["Jahr"]
["Räume"]
["Büros"]
{"$rows_left_out":10}
{"sheet":"Shulung","index":6,"n_rows":43,"n_cols":3,"rows_kept":43,"cut":false,"hidden":false,"merged":[]}
[]
[null,"Kurzbefehle "]
["FN + F2","Text direkt in der Zelle ändern"]
["ALT + Enter","Zeilenumbruch im Excel"]
["Esc","Raus aus dem Feld ohne änderung (Escape)"]
["Strg + C","Kopieren"]
["Strg + V","Einfügen "]
[]
[]
[null,"   "]
[null,"Empfohlene Vorbereitung"]
[1,"Kunden anlegen (möglichst mit Personennamen)"]
[{"$f":"A12+1","v":2},"Dienstleistungen und Produkte anlegen mit Preis und Einheit (= Preisliste wie Kassa)"]
[{"$f":"A13+1","v":3},"Dienstleistungs-Pakete anlegen als Vorlage\n(Mengen, Einheiten und Preise wie auf Rechnung üblich= wie Rechnungsvorlage)"]
[4,"Zahlungsbedingung die normal verwendet wird definieren"]
[5,"Schlusstext auswählen "]
[]
[]
[null,"Anleitung für Rechnungsvorlage, Angebot usw","manuell"]
[1,"Kunden auswählen"]
{"$rows_left_out":23}